Target
Aurora kinase B
Ligand
BDBM50335340
Substrate
Meas. Tech.
ChEMBL_701579 (CHEMBL1656338)
IC50
930±n/a nM
Citation
 Prime, MECourtney, SMBrookfield, FAMarston, RWWalker, VWarne, JBoyd, AEKairies, NAvon der Saal, WLimberg, AGeorges, GEngh, RAGoller, BRueger, PRueth, M Phthalazinone pyrazoles as potent, selective, and orally bioavailable inhibitors of Aurora-A kinase. J Med Chem 54:312-9 (2011)  
Target
Name:
Aurora kinase B
Synonyms:
AIK2 AIM1 ARK2 AURKB_HUMAN Aurora B-INCENP Aurora kinase B (AURKB) STK-1 STK12 Serine/threonine-protein kinase aurora B
Type:
Protein
Mol. Mass.:
39327.72
Organism:
Homo sapiens (Human)
Description:
Q96GD4
Residue:
344
  
Inhibitor
Name:
BDBM50335340
Synonyms:
4-(5-Methyl-1H-pyrazol-3-ylamino)-2-(4-nitrobenzyl)-2Hphthalazin-1-one | CHEMBL1651483
Type:
Small organic molecule
Emp. Form.:
C19H16N6O3
Mol. Mass.:
376.3687
SMILES:
Cc1cc(Nc2nn(Cc3ccc(cc3)[N+]([O-])=O)c(=O)c3ccccc23)[nH]n1
: