Target
Aurora kinase A
Ligand
BDBM50335337
Substrate
Meas. Tech.
ChEMBL_701578 (CHEMBL1656337)
IC50
67±n/a nM
Citation
 Prime, MECourtney, SMBrookfield, FAMarston, RWWalker, VWarne, JBoyd, AEKairies, NAvon der Saal, WLimberg, AGeorges, GEngh, RAGoller, BRueger, PRueth, M Phthalazinone pyrazoles as potent, selective, and orally bioavailable inhibitors of Aurora-A kinase. J Med Chem 54:312-9 (2011)  
Target
Name:
Aurora kinase A
Synonyms:
AIK ARK1 AURKA AYK1 Aurora kinase A (AURA) Aurora kinase A (Aurora A) Aurora-related kinase 1 BTAK Breast-tumor-amplified kinase STK15 Serine/threonine kinase 15 Serine/threonine-protein kinase aurora A hARK1
Type:
Serine/threonine-protein kinase
Mol. Mass.:
45830.98
Organism:
Homo sapiens (Human)
Description:
O14965
Residue:
403
  
Inhibitor
Name:
BDBM50335337
Synonyms:
2-[2-(4-Methoxyphenyl)-2-oxoethyl]-4-(5-methyl-1H-pyrazol-3-ylamino)-2H-phthalazin-1-one | CHEMBL1651484
Type:
Small organic molecule
Emp. Form.:
C21H19N5O3
Mol. Mass.:
389.4073
SMILES:
COc1ccc(cc1)C(=O)Cn1nc(Nc2cc(C)n[nH]2)c2ccccc2c1=O
: