Target
Aurora kinase A
Ligand
BDBM50335340
Substrate
Meas. Tech.
ChEMBL_701578 (CHEMBL1656337)
IC50
109±n/a nM
Citation
 Prime, MECourtney, SMBrookfield, FAMarston, RWWalker, VWarne, JBoyd, AEKairies, NAvon der Saal, WLimberg, AGeorges, GEngh, RAGoller, BRueger, PRueth, M Phthalazinone pyrazoles as potent, selective, and orally bioavailable inhibitors of Aurora-A kinase. J Med Chem 54:312-9 (2011)  
Target
Name:
Aurora kinase A
Synonyms:
AIK ARK-1 AURA AURKA_HUMAN Aurora 2 Aurora kinase A (AURKA) Aurora kinase A (Aurora-2) Aurora/IPL1-related kinase 1 Breast tumor-amplified kinase IAK1 STK15 GN Serine/threonine kinase 15 Serine/threonine-protein kinase 6 Serine/threonine-protein kinase aurora-A aurora-2 | hARK1
Type:
Serine/threonine-protein kinase
Mol. Mass.:
45830.98
Organism:
Homo sapiens (Human)
Description:
O14965
Residue:
403
  
Inhibitor
Name:
BDBM50335340
Synonyms:
4-(5-Methyl-1H-pyrazol-3-ylamino)-2-(4-nitrobenzyl)-2Hphthalazin-1-one | CHEMBL1651483
Type:
Small organic molecule
Emp. Form.:
C19H16N6O3
Mol. Mass.:
376.3687
SMILES:
Cc1cc(Nc2nn(Cc3ccc(cc3)[N+]([O-])=O)c(=O)c3ccccc23)[nH]n1
: