Target
Aurora kinase A
Ligand
BDBM50335319
Substrate
Meas. Tech.
ChEMBL_701578 (CHEMBL1656337)
IC50
650±n/a nM
Citation
 Prime, MECourtney, SMBrookfield, FAMarston, RWWalker, VWarne, JBoyd, AEKairies, NAvon der Saal, WLimberg, AGeorges, GEngh, RAGoller, BRueger, PRueth, M Phthalazinone pyrazoles as potent, selective, and orally bioavailable inhibitors of Aurora-A kinase. J Med Chem 54:312-9 (2011)  
Target
Name:
Aurora kinase A
Synonyms:
AIK ARK1 AURKA AYK1 Aurora kinase A (AURA) Aurora kinase A (Aurora A) Aurora-related kinase 1 BTAK Breast-tumor-amplified kinase STK15 Serine/threonine kinase 15 Serine/threonine-protein kinase aurora A hARK1
Type:
Serine/threonine-protein kinase
Mol. Mass.:
45830.98
Organism:
Homo sapiens (Human)
Description:
O14965
Residue:
403
  
Inhibitor
Name:
BDBM50335319
Synonyms:
4-(5-Methyl-1H-pyrazol-3-ylamino)-2H-phthalazin-1-one | CHEMBL1651468
Type:
Small organic molecule
Emp. Form.:
C12H11N5O
Mol. Mass.:
241.2486
SMILES:
Cc1cc(Nc2n[nH]c(=O)c3ccccc23)[nH]n1
: