Target
Signal transducer and activator of transcription 3
Ligand
BDBM50335441
Substrate
Meas. Tech.
ChEMBL_701933 (CHEMBL1657357)
Kd
1800±n/a nM
Citation
 Shahani, VMYue, PHaftchenary, SZhao, WLukkarila, JLZhang, XBall, DNona, CGunning, PTTurkson, J Identification of Purine-Scaffold Small-Molecule Inhibitors of Stat3 Activation by QSAR Studies. ACS Med Chem Lett 2:79-84 (2011)  
Target
Name:
Signal transducer and activator of transcription 3
Synonyms:
Acute-phase response factor STAT3 alpha Signal transducer and activator of transcription 3 Transcription Factor STAT3
Type:
Cytosolic Transcription Factor
Mol. Mass.:
88050.28
Organism:
Mus musculus (mouse)
Description:
Bacterially expressed protein was used in the FP assay.
Residue:
770
  
Inhibitor
Name:
BDBM50335441
Synonyms:
2-(2-((4-cyclohexylbenzyl)amino)-6-morpholino-9H-purin-9-yl)acetic acid | CHEMBL1651681
Type:
Small organic molecule
Emp. Form.:
C24H30N6O3
Mol. Mass.:
450.5334
SMILES:
OC(=O)Cn1cnc2c(nc(NCc3ccc(cc3)C3CCCCC3)nc12)N1CCOCC1
: