Target
Signal transducer and activator of transcription 3
Ligand
BDBM50335408
Substrate
Meas. Tech.
ChEMBL_701933 (CHEMBL1657357)
Kd
900±n/a nM
Citation
 Shahani, VMYue, PHaftchenary, SZhao, WLukkarila, JLZhang, XBall, DNona, CGunning, PTTurkson, J Identification of Purine-Scaffold Small-Molecule Inhibitors of Stat3 Activation by QSAR Studies. ACS Med Chem Lett 2:79-84 (2011)  
Target
Name:
Signal transducer and activator of transcription 3
Synonyms:
Acute-phase response factor STAT3 alpha Signal transducer and activator of transcription 3 Transcription Factor STAT3
Type:
Cytosolic Transcription Factor
Mol. Mass.:
88050.28
Organism:
Mus musculus (mouse)
Description:
Bacterially expressed protein was used in the FP assay.
Residue:
770
  
Inhibitor
Name:
BDBM50335408
Synonyms:
2-(2-((tert-butoxycarbonyl)(pentyl)amino)-6-(phenylamino)-9H-purin-9-yl)acetic acid | CHEMBL1651694
Type:
Small organic molecule
Emp. Form.:
C23H30N6O4
Mol. Mass.:
454.5221
SMILES:
CCCCCN(C(=O)OC(C)(C)C)c1nc(Nc2ccccc2)c2ncn(CC(O)=O)c2n1
: