Target
Signal transducer and activator of transcription 3
Ligand
BDBM50335426
Substrate
Meas. Tech.
ChEMBL_701933 (CHEMBL1657357)
Kd
4200±n/a nM
Citation
 Shahani, VMYue, PHaftchenary, SZhao, WLukkarila, JLZhang, XBall, DNona, CGunning, PTTurkson, J Identification of Purine-Scaffold Small-Molecule Inhibitors of Stat3 Activation by QSAR Studies. ACS Med Chem Lett 2:79-84 (2011)  
Target
Name:
Signal transducer and activator of transcription 3
Synonyms:
Acute-phase response factor STAT3 alpha Signal transducer and activator of transcription 3 Transcription Factor STAT3
Type:
Cytosolic Transcription Factor
Mol. Mass.:
88050.28
Organism:
Mus musculus (mouse)
Description:
Bacterially expressed protein was used in the FP assay.
Residue:
770
  
Inhibitor
Name:
BDBM50335426
Synonyms:
2-(6-morpholino-2-(pentylamino)-9H-purin-9-yl)acetic acid | CHEMBL1651666
Type:
Small organic molecule
Emp. Form.:
C16H24N6O3
Mol. Mass.:
348.4002
SMILES:
CCCCCNc1nc(N2CCOCC2)c2ncn(CC(O)=O)c2n1
: