Target
Mu-type opioid receptor
Ligand
BDBM50335570
Substrate
Meas. Tech.
ChEMBL_714492 (CHEMBL1659150)
EC50
3500±n/a nM
Citation
 Hayashi, SNakata, EMorita, AMizuno, KYamamura, KKato, AOhashi, K Discovery of {1-[4-(2-{hexahydropyrrolo[3,4-c]pyrrol-2(1H)-yl}-1H-benzimidazol-1-yl)piperidin-1-yl]cyclooctyl}methanol, systemically potent novel non-peptide agonist of nociceptin/orphanin FQ receptor as analgesic for the treatment of neuropathic pain: design, synthesis, and structure-activity rela Bioorg Med Chem 18:7675-99 (2010)  
Target
Name:
Mu-type opioid receptor
Synonyms:
M-OR-1 MOR-1 MUOR1 Mu opiate receptor OPRM1 hMOP | mu-type opioid receptor isoform MOR-1
Type:
G Protein-Coupled Receptor (GPCR)
Mol. Mass.:
44789.51
Organism:
Homo sapiens (Human)
Description:
P35372
Residue:
400
  
Inhibitor
Name:
BDBM50335570
Synonyms:
CHEMBL1650844 | {1-[4-(2-{Hexahydropyrrolo[3,4-c]pyrrol-2(1H)-yl}-1Hbenzimidazol-1-yl)piperidin-1-yl]cyclooctyl}methanol
Type:
Small organic molecule
Emp. Form.:
C27H41N5O
Mol. Mass.:
451.6473
SMILES:
OCC1(CCCCCCC1)N1CCC(CC1)n1c(nc2ccccc12)N1CC2CNCC2C1
: