Target
Kappa-type opioid receptor
Ligand
BDBM50335567
Substrate
Meas. Tech.
ChEMBL_714490 (CHEMBL1659148)
EC50
18±n/a nM
Citation
 Hayashi, SNakata, EMorita, AMizuno, KYamamura, KKato, AOhashi, K Discovery of {1-[4-(2-{hexahydropyrrolo[3,4-c]pyrrol-2(1H)-yl}-1H-benzimidazol-1-yl)piperidin-1-yl]cyclooctyl}methanol, systemically potent novel non-peptide agonist of nociceptin/orphanin FQ receptor as analgesic for the treatment of neuropathic pain: design, synthesis, and structure-activity rela Bioorg Med Chem 18:7675-99 (2010)  
Target
Name:
Kappa-type opioid receptor
Synonyms:
K-OR-1 Kappa-opioid receptor (KOR) Kappa-type opioid receptor (KOR) OPIATE Kappa OPRK1 kappa opioid receptor (KOR)
Type:
G Protein-Coupled Receptor (GPCR)
Mol. Mass.:
42648.76
Organism:
Homo sapiens (Human)
Description:
P41145
Residue:
380
  
Inhibitor
Name:
BDBM50335567
Synonyms:
(1-{4-[2-(4-Methylpiperazin-1-yl)-1H-benzimidazol-1-yl]piperidin-1-yl}cyclooctyl)methanol | CHEMBL1650847
Type:
Small organic molecule
Emp. Form.:
C26H41N5O
Mol. Mass.:
439.6366
SMILES:
CN1CCN(CC1)c1nc2ccccc2n1C1CCN(CC1)C1(CO)CCCCCCC1
: