Target
Metabotropic glutamate receptor 4
Ligand
BDBM50336633
Substrate
Meas. Tech.
ChEMBL_725845 (CHEMBL1678441)
EC50
2090±n/a nM
Citation
 Engers, DWField, JRLe, UZhou, YBolinger, JDZamorano, RBlobaum, ALJones, CKJadhav, SWeaver, CDConn, PJLindsley, CWNiswender, CMHopkins, CR Discovery, synthesis, and structure-activity relationship development of a series of N-(4-acetamido)phenylpicolinamides as positive allosteric modulators of metabotropic glutamate receptor 4 (mGlu(4)) with CNS exposure in rats. J Med Chem 54:1106-10 (2011)  
Target
Name:
Metabotropic glutamate receptor 4
Synonyms:
GPRC1D GRM4_HUMAN MGLUR4 Metabotropic glutamate receptor 4 (mGlu4) metabotropic glutamate 4
Type:
Protein
Mol. Mass.:
101899.95
Organism:
Homo sapiens (Human)
Description:
Q14833
Residue:
912
  
Inhibitor
Name:
BDBM50336633
Synonyms:
CHEMBL1672239 | N-(4-(2-chlorobenzamido)-3-(trifluoromethyl)phenyl)picolinamide
Type:
Small organic molecule
Emp. Form.:
C20H13ClF3N3O2
Mol. Mass.:
419.784
SMILES:
FC(F)(F)c1cc(NC(=O)c2ccccn2)ccc1NC(=O)c1ccccc1Cl
: