Target
Adenosine receptor A1
Ligand
BDBM50336713
Substrate
Meas. Tech.
ChEMBL_718205 (CHEMBL1679251)
Ki
580±n/a nM
Citation
 Sams, AGMikkelsen, GKLarsen, MLanggård, MHowells, MESchrøder, TJBrennum, LTTorup, LJørgensen, EBBundgaard, CKreilgård, MBang-Andersen, B Discovery of phosphoric acid mono-{2-[(E/Z)-4-(3,3-dimethyl-butyrylamino)-3,5-difluoro-benzoylimino]-thiazol-3-ylmethyl} ester (Lu AA47070): a phosphonooxymethylene prodrug of a potent and selective hA(2A) receptor antagonist. J Med Chem 54:751-64 (2012)  
Target
Name:
Adenosine receptor A1
Synonyms:
A1 adenosine receptor (hA1) AA1R_HUMAN ADORA1 Adenosine A1-receptor Adenosine receptor A1 (hA1) | Adenosine transporter (AdT)
Type:
G Protein-Coupled Receptor (GPCR)
Mol. Mass.:
36520.92
Organism:
Homo sapiens (Human)
Description:
P30542
Residue:
326
  
Inhibitor
Name:
BDBM50336713
Synonyms:
3-Chloro-4-(3,3-dimethyl-butyrylamino)-5-methyl-N-thiazol-2-yl-benzamide | CHEMBL1671937
Type:
Small organic molecule
Emp. Form.:
C17H20ClN3O2S
Mol. Mass.:
365.878
SMILES:
Cc1cc(cc(Cl)c1NC(=O)CC(C)(C)C)C(=O)Nc1nccs1
: