Target
Retinoic acid receptor RXR-alpha
Ligand
BDBM50032675
Substrate
Meas. Tech.
ChEMBL_718369 (CHEMBL1679901)
EC50
2.7±n/a nM
Citation
 Patch, RJSearle, LLKim, AJDe, DZhu, XAskari, HBO'Neill, JCAbad, MCRentzeperis, DLiu, JKemmerer, MLin, LKasturi, JGeisler, JGLenhard, JMPlayer, MRGaul, MD Identification of diaryl ether-based ligands for estrogen-related receptora as potential antidiabetic agents. J Med Chem 54:788-808 (2012)  
Target
Name:
Retinoic acid receptor RXR-alpha
Synonyms:
NR2B1 Nuclear receptor subfamily 4 group A member 2 RXRA Retinoic acid receptor RXR-alpha/gamma Retinoid receptor
Type:
PROTEIN
Mol. Mass.:
50820.38
Organism:
Homo sapiens (Human)
Description:
ChEMBL_1456363
Residue:
462
  
Inhibitor
Name:
BDBM50032675
Synonyms:
4-[1-(3,5,5,8,8-pentamethyl-5,6,7,8-tetrahydronaphthalen-2-yl)vinyl]benzoic acid CHEMBL1023 | p-(1-(5,6,7,8-Tetrahydro-3,5,5,8,8-pentamethyl-2-naphthyl)vinyl)benzoic acid
Type:
Small organic molecule
Emp. Form.:
C24H28O2
Mol. Mass.:
348.4779
SMILES:
Cc1cc2c(cc1C(=C)c1ccc(cc1)C(O)=O)C(C)(C)CCC2(C)C
: