Target
Metabotropic glutamate receptor 5
Ligand
BDBM50258612
Substrate
Meas. Tech.
ChEMBL_718850 (CHEMBL1681232)
Ki
0.080000±n/a nM
Citation
 Siméon, FGWendahl, MTPike, VW Syntheses of 2-amino and 2-halothiazole derivatives as high-affinity metabotropic glutamate receptor subtype 5 ligands and potential radioligands for in vivo imaging. J Med Chem 54:901-8 (2012)  
Target
Name:
Metabotropic glutamate receptor 5
Synonyms:
GRM5_RAT Grm5 Mglur5 metabotropic glutamate 5/1-C metabotropic glutamate 5a
Type:
Enzyme
Mol. Mass.:
131900.14
Organism:
Rattus norvegicus (Rat)
Description:
P31424
Residue:
1203
  
Inhibitor
Name:
BDBM50258612
Synonyms:
3-Fluoro-5-cyano-1-(2-methylthiazol-4-ylethynyl)benzene | CHEMBL446543
Type:
Small organic molecule
Emp. Form.:
C13H7FN2S
Mol. Mass.:
242.271
SMILES:
Cc1nc(cs1)C#Cc1cc(F)cc(c1)C#N
: