Target
Tyrosine-protein phosphatase non-receptor type 7
Ligand
BDBM88776
Substrate
Meas. Tech.
ChEMBL_718192 (CHEMBL1679238)
Ki
690±n/a nM
Citation
 Bobkova, EVLiu, WHColayco, SRascon, JVasile, SGasior, CCritton, DAChan, XDahl, RSu, YSergienko, EChung, TDMustelin, TPage, RTautz, L Inhibition of the Hematopoietic Protein Tyrosine Phosphatase by Phenoxyacetic Acids. ACS Med Chem Lett 2:113-118 (2011)  
Target
Name:
Tyrosine-protein phosphatase non-receptor type 7
Synonyms:
He-PTP Hematopoietic protein-tyrosine phosphatase (HEPTP) PTPN7 Tyrosine-protein phosphatase non-receptor type 7 | Tyrosine-protein phosphatase non-receptor type 7 (HEPTP)
Type:
Protein
Mol. Mass.:
40530.79
Organism:
Homo sapiens (Human)
Description:
P35236
Residue:
360
  
Inhibitor
Name:
BDBM88776
Synonyms:
2-[4-[(Z)-[5-(4-chlorophenyl)-6-isopropoxycarbonyl-3-keto-7-methyl-5H-thiazolo[3,2-a]pyrimidin-2-ylidene]methyl]phenoxy]acetic acid 2-[4-[(Z)-[5-(4-chlorophenyl)-7-methyl-3-oxo-6-[oxo(propan-2-yloxy)methyl]-5H-thiazolo[3,2-a]pyrimidin-2-ylidene]methyl]phenoxy]acetic acid MLS001178474 cid_5777336 | {4-[(5-(4-chlorophenyl)-6-(isopropoxycarbonyl)-7-methyl-3-oxo-5H-[1,3]thiazolo[3,2-a]pyrimidin-2(3H)-ylidene)methyl]phenoxy}acetic acid
Type:
Small organic molecule
Emp. Form.:
C26H23ClN2O6S
Mol. Mass.:
526.989
SMILES:
CC(C)OC(=O)C1=C(C)N=c2s\c(=C/c3ccc(OCC(O)=O)cc3)c(=O)n2C1c1ccc(Cl)cc1
: