Target
Histone deacetylase 8
Ligand
BDBM26109
Substrate
Meas. Tech.
ChEMBL_718471 (CHEMBL1680135)
IC50
15000±n/a nM
Citation
 Fass, DMShah, RGhosh, BHennig, KNorton, SZhao, WNReis, SAKlein, PSMazitschek, RMaglathlin, RLLewis, TAHaggarty, SJ Effect of Inhibiting Histone Deacetylase with Short-Chain Carboxylic Acids and Their Hydroxamic Acid Analogs on Vertebrate Development and Neuronal Chromatin. ACS Med Chem Lett 2:39-42 (2011)  
Target
Name:
Histone deacetylase 8
Synonyms:
HD8 HDAC8_HUMAN Histone deacetylase 8 (HDAC-8) | Human HDAC8
Type:
Enzyme
Mol. Mass.:
41749.60
Organism:
Homo sapiens (Human)
Description:
Q9BY41
Residue:
377
  
Inhibitor
Name:
BDBM26109
Synonyms:
Butyrate butanoic acid, 4
Type:
Small organic molecule
Emp. Form.:
C4H8O2
Mol. Mass.:
88.1051
SMILES:
CCCC(O)=O
: