Target
KiSS-1 receptor
Ligand
BDBM26349
Substrate
Meas. Tech.
ChEMBL_718922 (CHEMBL1681416)
IC50
0.120±n/a nM
Citation
 Oishi, SMisu, RTomita, KSetsuda, SMasuda, ROhno, HNaniwa, YIeda, NInoue, NOhkura, SUenoyama, YTsukamura, HMaeda, KHirasawa, ATsujimoto, GFujii, N Activation of Neuropeptide FF Receptors by Kisspeptin Receptor Ligands. ACS Med Chem Lett 2:53-57 (2011)  
Target
Name:
KiSS-1 receptor
Synonyms:
AXOR12 G-protein coupled receptor 54 (GPR54) Hypogonadotropin-1 KISSR_HUMAN Kisspeptins receptor hOT7T175
Type:
G Protein-Coupled Receptor (GPCR)
Mol. Mass.:
42613.79
Organism:
Homo sapiens (Human)
Description:
Binding assay was performed using membranes from the CHO cell transfectants.
Residue:
398
  
Inhibitor
Name:
BDBM26349
Synonyms:
(2S)-2-[(2S)-2-[(2S)-2-[(2S)-2-amino-3-(4-hydroxyphenyl)propanamido]butanediamido]-3-(1H-indol-3-yl)propanamido]-N-[(1S)-1-{[(1S)-1-[({[(1S)-1-{[(1S)-4-carbamimidamido-1-{[(1S)-1-carbamoyl-2-phenylethyl]carbamoyl}butyl]carbamoyl}-3-methylbutyl]carbamoyl}methyl)carbamoyl]-2-phenylethyl]carbamoyl}-2-hydroxyethyl]butanediamide Kisspeptin-10
Type:
10-mer
Emp. Form.:
C63H83N17O14
Mol. Mass.:
1302.4386
SMILES:
CC(C)C[C@H](NC(=O)CNC(=O)[C@H](Cc1ccccc1)NC(=O)[C@H](CO)NC(=O)[C@H](CC(N)=O)NC(=O)[C@H](Cc1c[nH]c2ccccc12)NC(=O)[C@H](CC(N)=O)NC(=O)[C@@H](N)Cc1ccc(O)cc1)C(=O)N[C@@H](CCCN=C(N)N)C(=O)N[C@@H](Cc1ccccc1)C(N)=O
: