Target
Sucrase-isomaltase, intestinal
Ligand
BDBM50316179
Substrate
Meas. Tech.
ChEMBL_726861 (CHEMBL1686567)
IC50
5700±n/a nM
Citation
 Xie, WTanabe, GAkaki, JMorikawa, TNinomiya, KMinematsu, TYoshikawa, MWu, XMuraoka, O Isolation, structure identification and SAR studies on thiosugar sulfonium salts, neosalaprinol and neoponkoranol, as potenta-glucosidase inhibitors. Bioorg Med Chem 19:2015-22 (2011)  
Target
Name:
Sucrase-isomaltase, intestinal
Synonyms:
SUIS_RAT Sucrase-isomaltase | alpha-Glucosidase (α-Glucosidase)
Type:
Enzyme
Mol. Mass.:
210329.04
Organism:
Rattus norvegicus (Rat)
Description:
P23739
Residue:
1841
  
Inhibitor
Name:
BDBM50316179
Synonyms:
(1S,2R,3R,4S)-1-{(1S)-2-[(2R,3S,4S)-3,4-dihydroxy-2-(hydroxymethyl)tetrahydrothiophenium-1-yl]-1-hydroxyethyl}-2,3,4,5-tetrahydroxypentyl sulfate CHEMBL1093264
Type:
Small organic molecule
Emp. Form.:
C12H24O12S2
Mol. Mass.:
424.442
SMILES:
OC[C@H](O)[C@@H](O)[C@@H](O)[C@H](OS([O-])(=O)=O)[C@H](O)C[S+]1C[C@@H](O)[C@H](O)[C@H]1CO
: