Target
Sucrase-isomaltase, intestinal
Ligand
BDBM50338674
Substrate
Meas. Tech.
ChEMBL_726861 (CHEMBL1686567)
IC50
>329000±n/a nM
Citation
 Xie, WTanabe, GAkaki, JMorikawa, TNinomiya, KMinematsu, TYoshikawa, MWu, XMuraoka, O Isolation, structure identification and SAR studies on thiosugar sulfonium salts, neosalaprinol and neoponkoranol, as potenta-glucosidase inhibitors. Bioorg Med Chem 19:2015-22 (2011)  
Target
Name:
Sucrase-isomaltase, intestinal
Synonyms:
SUIS_RAT Sucrase-isomaltase | alpha-Glucosidase (α-Glucosidase)
Type:
Enzyme
Mol. Mass.:
210329.04
Organism:
Rattus norvegicus (Rat)
Description:
P23739
Residue:
1841
  
Inhibitor
Name:
BDBM50338674
Synonyms:
2'-epi-salaprinol | CHEMBL1684164
Type:
Small organic molecule
Emp. Form.:
C8H16O8S2
Mol. Mass.:
304.338
SMILES:
OC[C@@H]1[C@@H](O)[C@H](O)C[S@+]1C[C@H](O)COS([O-])(=O)=O
: