Target
Cytochrome P450 3A4
Ligand
BDBM50343359
Substrate
Meas. Tech.
ChEMBL_746947 (CHEMBL1777313)
IC50
600±n/a nM
Citation
 Zehnder, LBennett, MMeng, JHuang, BNinkovic, SWang, FBraganza, JTatlock, JJewell, TZhou, JZBurke, BWang, JMaegley, KMehta, PPYin, MJGajiwala, KSHickey, MJYamazaki, SSmith, EKang, PSistla, ADovalsantos, EGehring, MRKania, RWythes, MKung, PP Optimization of potent, selective, and orally bioavailable pyrrolodinopyrimidine-containing inhibitors of heat shock protein 90. Identification of development candidate 2-amino-4-{4-chloro-2-[2-(4-fluoro-1H-pyrazol-1-yl)ethoxy]-6-methylphenyl}-N-(2,2-difluoropropyl)-5,7-dihydro-6H-pyrrolo[3,4-d]pyr J Med Chem 54:3368-85 (2011)  
Target
Name:
Cytochrome P450 3A4
Synonyms:
Albendazole monooxygenase CP3A4_HUMAN CYP3A4 CYPIIIA4 Cytochrome P450 3A4 (CYP3A4) Nifedipine oxidase Taurochenodeoxycholate 6-alpha-hydroxylase
Type:
Enzyme
Mol. Mass.:
57349.57
Organism:
Homo sapiens (Human)
Description:
Residue:
503
  
Inhibitor
Name:
BDBM50343359
Synonyms:
2-Amino-4-{2,4-dichloro-6-[2-(4-fluoropyrazol-1-yl)ethoxy]phenyl}-5,7-dihydropyrrolo[3,4-d]pyrimidine-6-carboxylic Acid(2,2-Difluoropropyl)amide | CHEMBL1774932
Type:
Small organic molecule
Emp. Form.:
C21H20Cl2F3N7O2
Mol. Mass.:
530.33
SMILES:
CC(F)(F)CNC(=O)N1Cc2nc(N)nc(c2C1)-c1c(Cl)cc(Cl)cc1OCCn1cc(F)cn1
: