Target
Solute carrier family 22 member 6
Ligand
BDBM50269985
Substrate
Meas. Tech.
ChEMBL_749031 (CHEMBL1781816)
Ki
79000±n/a nM
Citation
 Kouznetsova, VLTsigelny, IFNagle, MANigam, SK Elucidation of common pharmacophores from analysis of targeted metabolites transported by the multispecific drug transporter-Organic anion transporter1 (Oat1). Bioorg Med Chem 19:3320-40 (2011)  
Target
Name:
Solute carrier family 22 member 6
Synonyms:
Nkt S22A6_MOUSE | Slc22a6
Type:
PROTEIN
Mol. Mass.:
60032.49
Organism:
Mus musculus
Description:
ChEMBL_508179
Residue:
545
  
Inhibitor
Name:
BDBM50269985
Synonyms:
2-oxo-3-phenylpropanoate keto-phenylpyruvate
Type:
Small organic molecule
Emp. Form.:
C9H7O3
Mol. Mass.:
163.1506
SMILES:
[O-]C(=O)C(=O)Cc1ccccc1
: