Target
Progesterone receptor
Ligand
BDBM50348411
Substrate
Meas. Tech.
ChEMBL_754804 (CHEMBL1805659)
Ki
55±n/a nM
Citation
 Yang, BVWeinstein, DSDoweyko, LMGong, HVaccaro, WHuynh, TXiao, HYDoweyko, AMMcKay, LHolloway, DASomerville, JEHabte, SCunningham, MMcMahon, MTownsend, RShuster, DDodd, JHNadler, SGBarrish, JC Dimethyl-diphenyl-propanamide Derivatives As Nonsteroidal Dissociated Glucocorticoid Receptor Agonists. J Med Chem 53:8241-51 (2010)  
Target
Name:
Progesterone receptor
Synonyms:
NR3C3 PGR PRGR_HUMAN | progesterone
Type:
Protein
Mol. Mass.:
98979.52
Organism:
Homo sapiens (Human)
Description:
P06401
Residue:
933
  
Inhibitor
Name:
BDBM50348411
Synonyms:
CHEMBL1800981
Type:
Small organic molecule
Emp. Form.:
C19H18FN3O2S
Mol. Mass.:
371.429
SMILES:
CC(C)([C@@H](c1ccccc1)c1ccc(O)c(F)c1)C(=O)Nc1nncs1
: