Target
Histamine H3 receptor
Ligand
BDBM50352798
Substrate
Meas. Tech.
ChEMBL_767071 (CHEMBL1826120)
Ki
3±n/a nM
Citation
 Sundar, BGBailey, TBacon, EAimone, LHuang, ZLyons, JRaddatz, RHudkins, R Amine-constrained pyridazinone histamine H3 receptor antagonists. Bioorg Med Chem Lett 21:5543-6 (2011)  
Target
Name:
Histamine H3 receptor
Synonyms:
HH3R Hrh3
Type:
G Protein-Coupled Receptor (GPCR)
Mol. Mass.:
48607.98
Organism:
Rattus norvegicus (rat)
Description:
Residue:
445
  
Inhibitor
Name:
BDBM50352798
Synonyms:
CHEMBL1823402
Type:
Small organic molecule
Emp. Form.:
C20H25N3O2
Mol. Mass.:
339.4314
SMILES:
Cn1nc(ccc1=O)-c1ccc(OC2CCN(CC2)C2CCC2)cc1
: