Target
Sigma non-opioid intracellular receptor 1
Ligand
BDBM50353612
Substrate
Meas. Tech.
ChEMBL_769558 (CHEMBL1833395)
Ki
0.55±n/a nM
Citation
 Schläger, TSchepmann, DLehmkuhl, KHolenz, JVela, JMBuschmann, HWünsch, B Combination of two pharmacophoric systems: synthesis and pharmacological evaluation of spirocyclic pyranopyrazoles with highs1 receptor affinity. J Med Chem 54:6704-13 (2011)  
Target
Name:
Sigma non-opioid intracellular receptor 1
Synonyms:
OPRS1 SIGMAR1 Sigma non-opioid intracellular receptor 1 Sigma1-receptor Sterol isomerase-like protein
Type:
Protein
Mol. Mass.:
25307.17
Organism:
Cavia porcellus (Guinea pig)
Description:
Q60492
Residue:
223
  
Inhibitor
Name:
BDBM50353612
Synonyms:
CHEMBL1829574
Type:
Small organic molecule
Emp. Form.:
C24H33N3O2
Mol. Mass.:
395.5377
SMILES:
COC1Cc2c(cnn2-c2ccccc2)C2(CCN(CC3CCCCC3)CC2)O1
: