Target
Cytochrome P450 2D6
Ligand
BDBM50355126
Substrate
Meas. Tech.
ChEMBL_772499 (CHEMBL1839391)
IC50
>30000±n/a nM
Citation
 Tao, MRaddatz, RAimone, LDHudkins, RL Synthesis and structure-activity relationships of 4,5-fused pyridazinones as histamine H3 receptor antagonists. Bioorg Med Chem Lett 21:6126-30 (2011)  
Target
Name:
Cytochrome P450 2D6
Synonyms:
CP2D6_HUMAN CYP2DL1 Cytochrome P450 2D6 (CYP2D6) P450-DB1
Type:
Protein
Mol. Mass.:
55774.82
Organism:
Homo sapiens (Human)
Description:
P10635
Residue:
497
  
Inhibitor
Name:
BDBM50355126
Synonyms:
CHEMBL1835706
Type:
Small organic molecule
Emp. Form.:
C23H27N3O2
Mol. Mass.:
377.4794
SMILES:
Cn1nc(-c2ccc(OCCCN3CCCCC3)cc2)c2ccccc2c1=O
: