Target
Vascular endothelial growth factor receptor 1
Ligand
BDBM50379186
Substrate
Meas. Tech.
ChEMBL_810793 (CHEMBL2016112)
IC50
3±n/a nM
Citation
 Hudkins, RLBecknell, NCZulli, ALUnderiner, TLAngeles, TSAimone, LDAlbom, MSChang, HMiknyoczki, SJHunter, KJones-Bolin, SZhao, HBacon, ERMallamo, JPAtor, MARuggeri, BA Synthesis and biological profile of the pan-vascular endothelial growth factor receptor/tyrosine kinase with immunoglobulin and epidermal growth factor-like homology domains 2 (VEGF-R/TIE-2) inhibitor 11-(2-methylpropyl)-12,13-dihydro-2-methyl-8-(pyrimidin-2-ylamino)-4H-indazolo[5,4-a]pyrrolo[3,4-c J Med Chem 55:903-13 (2012)  
Target
Name:
Vascular endothelial growth factor receptor 1
Synonyms:
FLT FRT Fms-like tyrosine kinase 1 Tyrosine-protein kinase FRT VEGFR-1 VGFR1_HUMAN Vascular endothelial growth factor receptor 1 (FLT1) Vascular endothelial growth factor receptor 1 and 2 (Flt-1 and KDR) Vascular permeability factor receptor vascular endothelial growth factor/vascular permeability factor receptor
Type:
Receptor Tyrosine Kinase
Mol. Mass.:
150800.23
Organism:
Homo sapiens (Human)
Description:
P17948
Residue:
1338
  
Inhibitor
Name:
BDBM50379186
Synonyms:
CEP-11981 | CHEMBL2010872
Type:
Small organic molecule
Emp. Form.:
C28H27N7O
Mol. Mass.:
477.5603
SMILES:
CC(C)Cn1c2ccc(Nc3ncccn3)cc2c2c3CNC(=O)c3c3-c4cn(C)nc4CCc3c12
: