Target
Broad substrate specificity ATP-binding cassette transporter ABCG2
Ligand
BDBM50379211
Substrate
Meas. Tech.
ChEMBL_811063 (CHEMBL2014643)
IC50
110±n/a nM
Citation
 Valdameri, GGenoux-Bastide, EPeres, BGauthier, CGuitton, JTerreux, RWinnischofer, SMRocha, MEBoumendjel, ADi Pietro, A Substituted chromones as highly potent nontoxic inhibitors, specific for the breast cancer resistance protein. J Med Chem 55:966-70 (2012)  
Target
Name:
Broad substrate specificity ATP-binding cassette transporter ABCG2
Synonyms:
ABCG2 ABCP ATP-binding cassette sub-family G member 2 ATP-binding cassette, sub-family G, member 2 BCRP1 CDw338 Mitoxantrone resistance-associated protein Urate exporter
Type:
Multi-pass membrane protein; monomer or homodimer; disulfide-linked
Mol. Mass.:
72329.48
Organism:
Homo sapiens (Human)
Description:
Q9UNQ0
Residue:
655
  
Inhibitor
Name:
BDBM50379211
Synonyms:
CHEMBL2011288
Type:
Small organic molecule
Emp. Form.:
C28H23BrN2O5
Mol. Mass.:
547.397
SMILES:
COc1ccc2[nH]cc(CCNC(=O)c3cc(=O)c4c(OCc5ccc(Br)cc5)cccc4o3)c2c1
: