Target
ATP-dependent RNA helicase DDX1
Ligand
BDBM50379301
Substrate
Meas. Tech.
ChEMBL_811952 (CHEMBL2013322)
IC50
>500000±n/a nM
Citation
 Radi, MFalchi, FGarbelli, ASamuele, ABernardo, VPaolucci, SBaldanti, FSchenone, SManetti, FMaga, GBotta, M Discovery of the first small molecule inhibitor of human DDX3 specifically designed to target the RNA binding site: towards the next generation HIV-1 inhibitors. Bioorg Med Chem Lett 22:2094-8 (2012)  
Target
Name:
ATP-dependent RNA helicase DDX1
Synonyms:
DBP-RB DDX1_HUMAN DEAD box protein retinoblastoma
Type:
PROTEIN
Mol. Mass.:
82440.79
Organism:
Homo sapiens (Human)
Description:
ChEMBL_811952
Residue:
740
  
Inhibitor
Name:
BDBM50379301
Synonyms:
CHEMBL2011809
Type:
Small organic molecule
Emp. Form.:
C13H14N4O
Mol. Mass.:
242.2765
SMILES:
Nc1cccc(NC(=O)Nc2cccc(N)c2)c1
: