Target
Potassium voltage-gated channel subfamily H member 2
Ligand
BDBM50379393
Substrate
Meas. Tech.
ChEMBL_811993 (CHEMBL2013363)
Ki
2300±n/a nM
Citation
 Bregman, HNguyen, HNFeric, ELigutti, JLiu, DMcDermott, JSWilenkin, BZou, AHuang, LLi, XMcDonough, SIDimauro, EF The discovery of aminopyrazines as novel, potent Na(v)1.7 antagonists: hit-to-lead identification and SAR. Bioorg Med Chem Lett 22:2033-42 (2012)  
Target
Name:
Potassium voltage-gated channel subfamily H member 2
Synonyms:
1,3-beta-glucan synthase component GLS2 ERG Eag-related protein 1 Ether-a-go-go-related gene (HERG) Ether-a-go-go-related gene potassium channel 1 Ether-a-go-go-related gene potassium channel 1 (hERG1) Ether-a-go-go-related protein 1 H-ERG KCNH2 Potassium voltage-gated channel subfamily H member 2 (hERG) Voltage-gated potassium channel subunit Kv11.1 hERG Potassium Channel 1 | putative potassium channel subunit
Type:
Multi-pass membrane protein
Mol. Mass.:
126672.65
Organism:
Homo sapiens (Human)
Description:
Q12809
Residue:
1159
  
Inhibitor
Name:
BDBM50379393
Synonyms:
CHEMBL2011947
Type:
Small organic molecule
Emp. Form.:
C15H12ClN5O
Mol. Mass.:
313.742
SMILES:
Nc1ncnc(Nc2ccc(Oc3ccc(Cl)cc3)cc2)n1
: