Target
Potassium voltage-gated channel subfamily H member 2
Ligand
BDBM50379469
Substrate
Meas. Tech.
ChEMBL_812135 (CHEMBL2013639)
Ki
1100±n/a nM
Citation
 Chakka, NBregman, HDu, BNguyen, HNBuchanan, JLFeric, ELigutti, JLiu, DMcDermott, JSZou, AMcDonough, SIDimauro, EF Discovery and hit-to-lead optimization of pyrrolopyrimidines as potent, state-dependent Na(v)1.7 antagonists. Bioorg Med Chem Lett 22:2052-62 (2012)  
Target
Name:
Potassium voltage-gated channel subfamily H member 2
Synonyms:
1,3-beta-glucan synthase component GLS2 ERG Eag-related protein 1 Ether-a-go-go-related gene (HERG) Ether-a-go-go-related gene potassium channel 1 Ether-a-go-go-related gene potassium channel 1 (hERG1) Ether-a-go-go-related protein 1 H-ERG KCNH2 Potassium voltage-gated channel subfamily H member 2 (hERG) Voltage-gated potassium channel subunit Kv11.1 hERG Potassium Channel 1 | putative potassium channel subunit
Type:
Multi-pass membrane protein
Mol. Mass.:
126672.65
Organism:
Homo sapiens (Human)
Description:
Q12809
Residue:
1159
  
Inhibitor
Name:
BDBM50379469
Synonyms:
CHEMBL2012295
Type:
Small organic molecule
Emp. Form.:
C24H24FN5O
Mol. Mass.:
417.4787
SMILES:
Fc1ccc(CN2CCC(CC2)Oc2ncnc3n(Cc4ccccc4)ccc23)nc1
: