Target
Cyclin-dependent kinase 1
Ligand
BDBM50379499
Substrate
Meas. Tech.
ChEMBL_812218 (CHEMBL2013813)
IC50
22±n/a nM
Citation
 Le Brazidec, JYPasis, ATam, BBoykin, CBlack, CWang, DClaassen, GChong, JHChao, JFan, JNguyen, KSilvian, LLing, LZhang, LChoi, MTeng, MPathan, NZhao, SLi, TTaveras, A Synthesis, SAR and biological evaluation of 1,6-disubstituted-1H-pyrazolo[3,4-d]pyrimidines as dual inhibitors of Aurora kinases and CDK1. Bioorg Med Chem Lett 22:2070-4 (2012)  
Target
Name:
Cyclin-dependent kinase 1
Synonyms:
CDC2 CDK1 CDKN1 Cell division protein kinase 1 P34CDC2 | p34 protein kinase
Type:
Enzyme Subunit
Mol. Mass.:
34101.08
Organism:
Homo sapiens (Human)
Description:
P06493
Residue:
297
  
Inhibitor
Name:
BDBM50379499
Synonyms:
CHEMBL2012411
Type:
Small organic molecule
Emp. Form.:
C23H29N7O2
Mol. Mass.:
435.5221
SMILES:
COC[C@@H]1CCCN1C(=O)c1cc(Nc2ncc3cnn([C@H]4C[C@@H]5C[C@@H]5C4)c3n2)cn1C
: