Target
RAC-beta serine/threonine-protein kinase
Ligand
BDBM50379531
Substrate
Meas. Tech.
ChEMBL_811120 (CHEMBL2014741)
IC50
311±n/a nM
Citation
 Bussenius, JAnand, NKBlazey, CMBowles, OJBannen, LCChan, DSChen, BCo, EWCostanzo, SDeFina, SCDubenko, LEngst, SFranzini, MHuang, PJammalamadaka, VKhoury, RGKim, MHKlein, RRLaird, DLe, DTMac, MBMatthews, DJMarkby, DMiller, NNuss, JMParks, JJTsang, THTsuhako, ALWang, YXu, WRice, KD Design and evaluation of a series of pyrazolopyrimidines as p70S6K inhibitors. Bioorg Med Chem Lett 22:2283-6 (2012)  
Target
Name:
RAC-beta serine/threonine-protein kinase
Synonyms:
AKT2 PKB beta Protein kinase B (Akt 2) Protein kinase B, beta RAC-alpha serine/threonine-protein kinase (AKT2) RAC-beta serine/threonine-protein kinase (AKT2) Serine/threonine-protein kinase AKT2 | Serine/threonine-protein kinase Rac alpha/beta
Type:
Enzyme
Mol. Mass.:
55766.64
Organism:
Homo sapiens (Human)
Description:
Residue:
481
  
Inhibitor
Name:
BDBM50379531
Synonyms:
CHEMBL2012702
Type:
Small organic molecule
Emp. Form.:
C20H26BrClN8
Mol. Mass.:
493.831
SMILES:
CN(C)CCNc1cc(Cl)cc(N2CCN(CC2)c2ncnc3n[nH]c(Br)c23)c1C
: