Target
Lethal factor
Ligand
BDBM50340768
Substrate
Meas. Tech.
ChEMBL_811334 (CHEMBL2013514)
Ki
1.2±n/a nM
Citation
 Jiao, GSKim, SMoayeri, MCrown, DThai, ACregar-Hernandez, LMcKasson, LSankaran, BLehrer, AWong, TJohns, LMargosiak, SALeppla, SHJohnson, AT Antidotes to anthrax lethal factor intoxication. Part 3: Evaluation of core structures and further modifications to the C2-side chain. Bioorg Med Chem Lett 22:2242-6 (2012)  
Target
Name:
Lethal factor
Synonyms:
Anthrax Lethal Factor (LF) Antrax lethal toxin lef | lethal factor
Type:
PROTEIN
Mol. Mass.:
93758.56
Organism:
Bacillus anthracis
Description:
ChEMBL_1460338
Residue:
809
  
Inhibitor
Name:
BDBM50340768
Synonyms:
(R)-2-(4-fluoro-3,5-dimethylphenoxy)-6-(4-fluorobenzylamino)-N-hydroxyhexanamide | CHEMBL1760322
Type:
Small organic molecule
Emp. Form.:
C21H26F2N2O3
Mol. Mass.:
392.4395
SMILES:
Cc1cc(O[C@H](CCCCNCc2ccc(F)cc2)C(=O)NO)cc(C)c1F
: