Target
Glutamate receptor ionotropic, NMDA 2B
Ligand
BDBM50379678
Substrate
Meas. Tech.
ChEMBL_812025 (CHEMBL2013395)
IC50
794.33±n/a nM
Citation
 Davies, DJCrowe, MLucas, NQuinn, JMiller, DDPritchard, SGrose, DBettini, ECalcinaghi, NVirginio, CAbberley, LGoldsmith, PMichel, ADChessell, IPKew, JNMiller, NDGunthorpe, MJ A novel series of benzimidazole NR2B-selective NMDA receptor antagonists. Bioorg Med Chem Lett 22:2620-3 (2012)  
Target
Name:
Glutamate receptor ionotropic, NMDA 2B
Synonyms:
GRIN2B Glutamate [NMDA] receptor subunit epsilon 2 N-methyl D-aspartate receptor subtype 2B NMDAR2B NR3 | hNR3
Type:
PROTEIN
Mol. Mass.:
166375.46
Organism:
Homo sapiens (Human)
Description:
ChEMBL_1438829
Residue:
1484
  
Inhibitor
Name:
BDBM50379678
Synonyms:
CHEMBL2013206
Type:
Small organic molecule
Emp. Form.:
C19H15F2N3O2
Mol. Mass.:
355.3381
SMILES:
Oc1ccc2nc([nH]c2c1CNCc1ccco1)-c1cccc(F)c1F
: