Target
Cytochrome P450 3A4
Ligand
BDBM50379681
Substrate
Meas. Tech.
ChEMBL_812035 (CHEMBL2013461)
IC50
>50000±n/a nM
Citation
 Davies, DJCrowe, MLucas, NQuinn, JMiller, DDPritchard, SGrose, DBettini, ECalcinaghi, NVirginio, CAbberley, LGoldsmith, PMichel, ADChessell, IPKew, JNMiller, NDGunthorpe, MJ A novel series of benzimidazole NR2B-selective NMDA receptor antagonists. Bioorg Med Chem Lett 22:2620-3 (2012)  
Target
Name:
Cytochrome P450 3A4
Synonyms:
Albendazole monooxygenase CP3A4_HUMAN CYP3A4 CYPIIIA4 Cytochrome P450 3A4 (CYP3A4) Nifedipine oxidase Taurochenodeoxycholate 6-alpha-hydroxylase
Type:
Enzyme
Mol. Mass.:
57349.57
Organism:
Homo sapiens (Human)
Description:
Residue:
503
  
Inhibitor
Name:
BDBM50379681
Synonyms:
CHEMBL2010880
Type:
Small organic molecule
Emp. Form.:
C19H21N3
Mol. Mass.:
291.3901
SMILES:
C(N1CCCCC1)c1cccc2nc([nH]c12)-c1ccccc1
: