Target
P2X purinoceptor 3
Ligand
BDBM50379736
Substrate
Meas. Tech.
ChEMBL_812331 (CHEMBL2014010)
IC50
67±n/a nM
Citation
 Cantin, LDBayrakdarian, MBuon, CGrazzini, EHu, YJLabrecque, JLeung, CLuo, XMartino, GParé, MPayza, KPopovic, NProjean, DSanthakumar, VWalpole, CYu, XHTomaszewski, MJ Discovery of P2X3 selective antagonists for the treatment of chronic pain. Bioorg Med Chem Lett 22:2565-71 (2012)  
Target
Name:
P2X purinoceptor 3
Synonyms:
ATP receptor P2RX3 P2X purinoceptor 3 P2X purinoceptor 3 (P2X3) P2X3 purinoceptor p2x3 + hsa
Type:
Protein
Mol. Mass.:
44292.02
Organism:
Homo sapiens (Human)
Description:
P56373
Residue:
397
  
Inhibitor
Name:
BDBM50379736
Synonyms:
CHEMBL2011116
Type:
Small organic molecule
Emp. Form.:
C24H29F3N6O4
Mol. Mass.:
522.5201
SMILES:
COc1cc(OC(F)(F)F)ccc1CNc1nc(nc2C(=O)N(Cc12)C(C)C)N1CCN(CC1)C(C)=O
: