Target
Serine/threonine-protein kinase Chk1
Ligand
BDBM50379641
Substrate
Meas. Tech.
ChEMBL_812462 (CHEMBL2014248)
IC50
0.050000±n/a nM
Citation
 Dudkin, VYRickert, KKreatsoulas, CWang, CArrington, KLFraley, MEHartman, GDYan, YIkuta, MStirdivant, SMDrakas, RAWalsh, ESHamilton, KBuser, CALobell, RBSepp-Lorenzino, L Pyridyl aminothiazoles as potent inhibitors of Chk1 with slow dissociation rates. Bioorg Med Chem Lett 22:2609-12 (2012)  
Target
Name:
Serine/threonine-protein kinase Chk1
Synonyms:
CHEK1 CHK1 checkpoint homolog Checkpoint kinase-1 (CHK1)
Type:
Enzyme Catalytic Domain
Mol. Mass.:
54443.02
Organism:
Homo sapiens (Human)
Description:
gi_166295192
Residue:
476
  
Inhibitor
Name:
BDBM50379641
Synonyms:
CHEMBL2010809
Type:
Small organic molecule
Emp. Form.:
C20H23N7O2S
Mol. Mass.:
425.507
SMILES:
NCCNC(=O)c1cncc(c1)-c1cnc(Nc2cc(ccn2)N2CCOCC2)s1
: