Target
Serine/threonine-protein kinase Chk1
Ligand
BDBM50379625
Substrate
Meas. Tech.
ChEMBL_812462 (CHEMBL2014248)
IC50
47±n/a nM
Citation
 Dudkin, VYRickert, KKreatsoulas, CWang, CArrington, KLFraley, MEHartman, GDYan, YIkuta, MStirdivant, SMDrakas, RAWalsh, ESHamilton, KBuser, CALobell, RBSepp-Lorenzino, L Pyridyl aminothiazoles as potent inhibitors of Chk1 with slow dissociation rates. Bioorg Med Chem Lett 22:2609-12 (2012)  
Target
Name:
Serine/threonine-protein kinase Chk1
Synonyms:
CHEK1 CHK1 checkpoint homolog Checkpoint kinase-1 (CHK1)
Type:
Enzyme Catalytic Domain
Mol. Mass.:
54443.02
Organism:
Homo sapiens (Human)
Description:
gi_166295192
Residue:
476
  
Inhibitor
Name:
BDBM50379625
Synonyms:
CHEMBL2011328
Type:
Small organic molecule
Emp. Form.:
C23H27N7O2S
Mol. Mass.:
465.571
SMILES:
O=C(CN1CCN(CC1)c1ccnc(Nc2ncc(s2)-c2cccnc2)c1)N1CCOCC1
: