Target
5-hydroxytryptamine receptor 2C
Ligand
BDBM31023
Substrate
Meas. Tech.
ChEMBL_809692 (CHEMBL2016003)
Ki
632±n/a nM
Citation
 Conway, RJValant, CChristopoulos, ARobertson, ADCapuano, BCrosby, IT Synthesis and SAR study of 4-arylpiperidines and 4-aryl-1,2,3,6-tetrahydropyridines as 5-HT2C agonists. Bioorg Med Chem Lett 22:2560-4 (2012)  
Target
Name:
5-hydroxytryptamine receptor 2C
Synonyms:
5-HT-2C 5-HT2C-INI 5-HTR2C 5-hydroxytryptamine receptor 2C (5-HT-2C) 5HT-1C HTR1C Serotonin (5-HT3) receptor Serotonin Receptor 2C
Type:
G Protein-Coupled Receptor (GPCR)
Mol. Mass.:
51836.79
Organism:
Homo sapiens (Human)
Description:
P28335
Residue:
458
  
Inhibitor
Name:
BDBM31023
Synonyms:
3-(1,2,3,6-tetrahydropyridin-4-yl)-1H-indole CHEMBL27811 SMR000029333 | cid_2761023
Type:
Small organic molecule
Emp. Form.:
C13H14N2
Mol. Mass.:
198.2637
SMILES:
C1CC(=CCN1)c1c[nH]c2ccccc12
: