Target
Beta-secretase 1
Ligand
BDBM50379898
Substrate
Meas. Tech.
ChEMBL_809982 (CHEMBL2015091)
IC50
630±n/a nM
Citation
 Cumming, JNSmith, EMWang, LMisiaszek, JDurkin, JPan, JIserloh, UWu, YZhu, ZStrickland, CVoigt, JChen, XKennedy, MEKuvelkar, RHyde, LACox, KFavreau, LCzarniecki, MFGreenlee, WJMcKittrick, BAParker, EMStamford, AW Structure based design of iminohydantoin BACE1 inhibitors: identification of an orally available, centrally active BACE1 inhibitor. Bioorg Med Chem Lett 22:2444-9 (2012)  
Target
Name:
Beta-secretase 1
Synonyms:
ASP2 Aspartyl protease 2 BACE1 Beta-secretase (BACE) Beta-secretase 1 (BACE 1) Beta-secretase 1 (BACE1) Beta-site amyloid precursor protein cleaving enzyme 1 Memapsin-2 beta-Secretase (BACE-1) | beta-Secretase (BACE1)
Type:
Protein
Mol. Mass.:
55755.10
Organism:
Homo sapiens (Human)
Description:
P56817
Residue:
501
  
Inhibitor
Name:
BDBM50379898
Synonyms:
CHEMBL2011983
Type:
Small organic molecule
Emp. Form.:
C21H18N4O
Mol. Mass.:
342.3938
SMILES:
CN1C(N)=N[C@](C1=O)(c1ccccc1)c1cccc(c1)-c1cccnc1
: