Target
Beta-secretase 1
Ligand
BDBM50379877
Substrate
Meas. Tech.
ChEMBL_809981 (CHEMBL2015090)
Ki
100±n/a nM
Citation
 Cumming, JNSmith, EMWang, LMisiaszek, JDurkin, JPan, JIserloh, UWu, YZhu, ZStrickland, CVoigt, JChen, XKennedy, MEKuvelkar, RHyde, LACox, KFavreau, LCzarniecki, MFGreenlee, WJMcKittrick, BAParker, EMStamford, AW Structure based design of iminohydantoin BACE1 inhibitors: identification of an orally available, centrally active BACE1 inhibitor. Bioorg Med Chem Lett 22:2444-9 (2012)  
Target
Name:
Beta-secretase 1
Synonyms:
ASP2 Aspartyl protease 2 BACE1 Beta-secretase (BACE) Beta-secretase 1 (BACE 1) Beta-secretase 1 (BACE1) Beta-site amyloid precursor protein cleaving enzyme 1 Memapsin-2 beta-Secretase (BACE-1) | beta-Secretase (BACE1)
Type:
Protein
Mol. Mass.:
55755.10
Organism:
Homo sapiens (Human)
Description:
P56817
Residue:
501
  
Inhibitor
Name:
BDBM50379877
Synonyms:
CHEMBL2012004
Type:
Small organic molecule
Emp. Form.:
C19H20N4O2
Mol. Mass.:
336.3877
SMILES:
COc1cncc(c1)-c1cccc(c1)C1(N=C(N)N(C)C1=O)C1CC1
: