Target
Beta-secretase 2
Ligand
BDBM50379876
Substrate
Meas. Tech.
ChEMBL_809985 (CHEMBL2015094)
Ki
139±n/a nM
Citation
 Cumming, JNSmith, EMWang, LMisiaszek, JDurkin, JPan, JIserloh, UWu, YZhu, ZStrickland, CVoigt, JChen, XKennedy, MEKuvelkar, RHyde, LACox, KFavreau, LCzarniecki, MFGreenlee, WJMcKittrick, BAParker, EMStamford, AW Structure based design of iminohydantoin BACE1 inhibitors: identification of an orally available, centrally active BACE1 inhibitor. Bioorg Med Chem Lett 22:2444-9 (2012)  
Target
Name:
Beta-secretase 2
Synonyms:
AEPLC ASP1 Asp 1 Aspartyl protease 1 BACE2_HUMAN Beta-secretase (BACE) Beta-secretase 2 (BACE-2) Beta-site APP-cleaving enzyme 2 Memapsin-1 beta-Secretase (BACE-2)
Type:
Protein
Mol. Mass.:
56171.20
Organism:
Homo sapiens (Human)
Description:
Q9Y5Z0
Residue:
518
  
Inhibitor
Name:
BDBM50379876
Synonyms:
CHEMBL2012006
Type:
Small organic molecule
Emp. Form.:
C18H17FN4O
Mol. Mass.:
324.3522
SMILES:
CN1C(N)=NC(C2CC2)(C1=O)c1cccc(c1)-c1cncc(F)c1
: