Target
Carbonic anhydrase 2
Ligand
BDBM50380153
Substrate
Meas. Tech.
ChEMBL_811723 (CHEMBL2014298)
Kd
220±n/a nM
Citation
 Capkauskaite, EZubriene, ABaranauskiene, LTamulaitiene, GManakova, EKairys, VGražulis, STumkevicius, SMatulis, D Design of [(2-pyrimidinylthio)acetyl]benzenesulfonamides as inhibitors of human carbonic anhydrases. Eur J Med Chem 51:259-70 (2012)  
Target
Name:
Carbonic anhydrase 2
Synonyms:
CA-II CAC Carbonate dehydratase II Carbonic anhydrase 2 (CA-II) Carbonic anhydrase C Carbonic anhydrase II (CA-II) Carbonic anhydrase II (hCA II) | Carbonic anhydrase isoenzyme II (hCA II)
Type:
Enzyme
Mol. Mass.:
29250.71
Organism:
Homo sapiens (Human)
Description:
P00918
Residue:
260
  
Inhibitor
Name:
BDBM50380153
Synonyms:
CHEMBL2010997
Type:
Small organic molecule
Emp. Form.:
C14H14ClN3O3S2
Mol. Mass.:
371.862
SMILES:
Cc1cc(C)nc(SCC(=O)c2ccc(Cl)c(c2)S(N)(=O)=O)n1
: