Target
Acetylcholinesterase
Ligand
BDBM23418
Substrate
Meas. Tech.
ChEMBL_811771 (CHEMBL2014392)
IC50
2476100±n/a nM
Citation
 Cho, JKRyu, YBCurtis-Long, MJRyu, HWYuk, HJKim, DWKim, HJLee, WSPark, KH Cholinestrase inhibitory effects of geranylated flavonoids from Paulownia tomentosa fruits. Bioorg Med Chem 20:2595-602 (2012)  
Target
Name:
Acetylcholinesterase
Synonyms:
ACES_HUMAN Acetylcholinesterase (AChE) | Acetylcholinesterase (human AChE)
Type:
Enzyme
Mol. Mass.:
67792.70
Organism:
Homo sapiens (Human)
Description:
P22303
Residue:
614
  
Inhibitor
Name:
BDBM23418
Synonyms:
(2S)-5,7-dihydroxy-2-(3-hydroxy-4-methoxyphenyl)-3,4-dihydro-2H-1-benzopyran-4-one Hesperitin
Type:
flavanone
Emp. Form.:
C16H14O6
Mol. Mass.:
302.2788
SMILES:
COc1ccc(cc1O)[C@@H]1CC(=O)c2c(O)cc(O)cc2O1
: