Target
Cell division cycle 7-related protein kinase/Protein DBF4 homolog A
Ligand
BDBM50380236
Substrate
Meas. Tech.
ChEMBL_813521 (CHEMBL2019529)
IC50
1±n/a nM
Citation
 Lindvall, MMcBride, CMcKenna, MGesner, TGYabannavar, AWong, KLin, SWalter, AShafer, CM 3D Pharmacophore Model-Assisted Discovery of Novel CDC7 Inhibitors. ACS Med Chem Lett 2:720-723 (2011)  
Target
Name:
Cell division cycle 7-related protein kinase/Protein DBF4 homolog A
Synonyms:
Activator of S phase kinase DBF4/Cell division cycle 7-related protein kinase CDC7/DBF4 (Cell division cycle 7-related protein kinase/Activator of S phase kinase)
Type:
Protein
Mol. Mass.:
Description:
Components:
This complex has 2 components.
Component 1
Name:
Protein DBF4 homolog A
Synonyms:
ASK Chiffon homolog A DBF4-type zinc finger-containing protein 1 DBF4A_HUMAN ZDBF1
Type:
Regulatory subunit
Mol. Mass.:
76869.65
Organism:
Homo sapiens (Human)
Description:
Residue:
674
  
Component 2
Name:
Cell division cycle 7-related protein kinase
Synonyms:
CDC7 CDC7L1 Cell division cycle 7-related protein kinase (CDC7) huCdc7
Type:
Protein
Mol. Mass.:
63908.16
Organism:
Homo sapiens (Human)
Description:
O00311
Residue:
574
  
Inhibitor
Name:
BDBM50380236
Synonyms:
CHEMBL2016856
Type:
Small organic molecule
Emp. Form.:
C16H18N2OS
Mol. Mass.:
286.392
SMILES:
O=C1CCC2(CCCCC2)c2sc(cc12)-c1cn[nH]c1
: