Target
MAP kinase-activated protein kinase 2
Ligand
BDBM51932
Substrate
Meas. Tech.
ChEMBL_813703 (CHEMBL2019905)
EC50
20000±n/a nM
Citation
 Huang, XShipps, GWCheng, CCSpacciapoli, PZhang, XMcCoy, MAWyss, DFYang, XAchab, ASoucy, KMontavon, DKMurphy, DMWhitehurst, CE Discovery and Hit-to-Lead Optimization of Non-ATP Competitive MK2 (MAPKAPK2) Inhibitors. ACS Med Chem Lett 2:632-637 (2011)  
Target
Name:
MAP kinase-activated protein kinase 2
Synonyms:
MAP kinase-activated protein kinase 2 (MAPKAPK2) MAP kinase-activated protein kinase 2 (p38/MK2) MAPK-activated protein kinase 2 MAPKAP kinase 2 MAPKAPK2 | MK2
Type:
Serine/threonine-protein kinase
Mol. Mass.:
45579.87
Organism:
Homo sapiens (Human)
Description:
P49137
Residue:
400
  
Inhibitor
Name:
BDBM51932
Synonyms:
5-(4-chlorophenyl)-N-[4-(4-methyl-1-piperazinyl)phenyl]-2-furancarboxamide 5-(4-chlorophenyl)-N-[4-(4-methylpiperazino)phenyl]-2-furamide MLS001125449 cid_1494312
Type:
Small organic molecule
Emp. Form.:
C22H22ClN3O2
Mol. Mass.:
395.882
SMILES:
CN1CCN(CC1)c1ccc(NC(=O)c2ccc(o2)-c2ccc(Cl)cc2)cc1
: