Target
Breast cancer type 1 susceptibility protein
Ligand
BDBM50345629
Substrate
Meas. Tech.
ChEMBL_812733 (CHEMBL2019951)
Ki
1960±n/a nM
Citation
 Yuan, ZKumar, EACampbell, SJPalermo, NYKizhake, SMark Glover, JNNatarajan, A Exploiting the P-1 pocket of BRCT domains toward a structure guided inhibitor design. ACS Med Chem Lett 2:764-767 (2011)  
Target
Name:
Breast cancer type 1 susceptibility protein
Synonyms:
BRCA1 RNF53
Type:
PROTEIN
Mol. Mass.:
207672.68
Organism:
Homo sapiens (Human)
Description:
ChEMBL_812733
Residue:
1863
  
Inhibitor
Name:
BDBM50345629
Synonyms:
(S)-2-acetamido-3-((S)-2-((S)-1-((S)-1-amino-1-oxo-3-phenylpropan-2-ylamino)-3-methyl-1-oxobutan-2-ylcarbamoyl)pyrrolidin-1-yl)-3-oxopropyl dihydrogen phosphate | CHEMBL1784703
Type:
Small organic molecule
Emp. Form.:
C24H36N5O9P
Mol. Mass.:
569.5445
SMILES:
CC(C)[C@H](NC(=O)[C@@H]1CCCN1C(=O)[C@H](COP(O)(O)=O)NC(C)=O)C(=O)N[C@@H](Cc1ccccc1)C(N)=O
: