Target
Nucleotide-binding oligomerization domain-containing protein 2
Ligand
BDBM62307
Substrate
Meas. Tech.
ChEMBL_812916 (CHEMBL2020291)
IC50
>20000±n/a nM
Citation
 Khan, PMCorrea, RGDivlianska, DBPeddibhotla, SSessions, EHMagnuson, GBrown, BSuyama, EYuan, HMangravita-Novo, AVicchiarelli, MSu, YVasile, SSmith, LHDiaz, PWReed, JCRoth, GP Identification of Inhibitors of NOD1-Induced Nuclear Factor-żB Activation. ACS Med Chem Lett 2:780-785 (2011)  
Target
Name:
Nucleotide-binding oligomerization domain-containing protein 2
Synonyms:
CARD15 IBD1 NOD2 Nucleotide-binding oligomerization domain-containing protein 2 | nucleotide-binding oligomerization domain containing 2
Type:
PROTEIN
Mol. Mass.:
115287.18
Organism:
Homo sapiens (Human)
Description:
ChEMBL_1454053
Residue:
1040
  
Inhibitor
Name:
BDBM62307
Synonyms:
(5,6-dimethyl-1-tosyl-benzimidazol-2-yl)amine 5,6-dimethyl-1-(4-methylphenyl)sulfonyl-benzimidazol-2-amine MLS-0425618.0001 | cid_44229067
Type:
Small organic molecule
Emp. Form.:
C16H17N3O2S
Mol. Mass.:
315.39
SMILES:
Cc1ccc(cc1)S(=O)(=O)n1c(N)nc2cc(C)c(C)cc12
: