Target
Cytochrome P450 1A2
Ligand
BDBM50380516
Substrate
Meas. Tech.
ChEMBL_813098 (CHEMBL2020672)
IC50
50000±n/a nM
Citation
 Foti, RSRock, DAHan, XFlowers, RAWienkers, LCWahlstrom, JL Ligand-based design of a potent and selective inhibitor of cytochrome P450 2C19. J Med Chem 55:1205-14 (2012)  
Target
Name:
Cytochrome P450 1A2
Synonyms:
CP1A2_HUMAN CYPIA2 Cytochrome P(3)450 Cytochrome P450 1A2 (CYP1A2) Cytochrome P450-P3
Type:
Enzyme
Mol. Mass.:
58423.38
Organism:
Homo sapiens (Human)
Description:
P05177
Residue:
516
  
Inhibitor
Name:
BDBM50380516
Synonyms:
CHEMBL2019025
Type:
Small organic molecule
Emp. Form.:
C14H11F2N3OS
Mol. Mass.:
307.318
SMILES:
FC(F)Oc1ccc2nc(SCc3ccccn3)[nH]c2c1
: