Target
Cytochrome P450 3A4
Ligand
BDBM50380516
Substrate
Meas. Tech.
ChEMBL_813105 (CHEMBL2020724)
IC50
10700±n/a nM
Citation
 Foti, RSRock, DAHan, XFlowers, RAWienkers, LCWahlstrom, JL Ligand-based design of a potent and selective inhibitor of cytochrome P450 2C19. J Med Chem 55:1205-14 (2012)  
Target
Name:
Cytochrome P450 3A4
Synonyms:
Albendazole monooxygenase CP3A4_HUMAN CYP3A4 CYPIIIA4 Cytochrome P450 3A4 (CYP3A4) Nifedipine oxidase Taurochenodeoxycholate 6-alpha-hydroxylase
Type:
Enzyme
Mol. Mass.:
57349.57
Organism:
Homo sapiens (Human)
Description:
Residue:
503
  
Inhibitor
Name:
BDBM50380516
Synonyms:
CHEMBL2019025
Type:
Small organic molecule
Emp. Form.:
C14H11F2N3OS
Mol. Mass.:
307.318
SMILES:
FC(F)Oc1ccc2nc(SCc3ccccn3)[nH]c2c1
: