Target
Poly [ADP-ribose] polymerase tankyrase-2
Ligand
BDBM50380599
Substrate
Meas. Tech.
ChEMBL_813155 (CHEMBL2020821)
IC50
197±n/a nM
Citation
 Shultz, MDKirby, CAStams, TChin, DNBlank, JCharlat, OCheng, HCheung, ACong, FFeng, YFortin, PDHood, TTyagi, VXu, MZhang, BShao, W [1,2,4]triazol-3-ylsulfanylmethyl)-3-phenyl-[1,2,4]oxadiazoles: antagonists of the Wnt pathway that inhibit tankyrases 1 and 2 via novel adenosine pocket binding. J Med Chem 55:1127-36 (2012)  
Target
Name:
Poly [ADP-ribose] polymerase tankyrase-2
Synonyms:
(ARTD6 or PARP5b) Poly [ADP-ribose] polymerase tankyrase-2 TNKL TNKS2_HUMAN Tankyrase 2 Tankyrase-2 Tankyrase-2 (TNKS2)
Type:
Enzyme
Mol. Mass.:
126937.16
Organism:
Homo sapiens (Human)
Description:
Q9H2K2
Residue:
1166
  
Inhibitor
Name:
BDBM50380599
Synonyms:
CHEMBL1364326
Type:
Small organic molecule
Emp. Form.:
C19H16FN5O2S
Mol. Mass.:
397.426
SMILES:
COc1ccc(cc1)-c1noc(CSc2nnc(C)n2-c2ccc(F)cc2)n1
: